سنگ‌های رسوبی
type: Concept
preferred label: sedimentary rocks @en
related: آبرفت

آبرفت
type: Concept
broader: خاک‌ها
preferred label: alluvium @en
related: سنگ‌های رسوبی
scope note: ماده‌ای ریزدانه و سیلتی. از جریان آب رودخانه نهشته می‌شود.

خاک‌ها
type: Concept
narrower: آبرفت
preferred label: soils @en