دمفشارها
type: Concept
alternative label: اتوکلاوها
broader: بارگنج‌ها
preferred label: autoclaves @en
related: فشار
scope note: دستگاهی که مواد خوراکی و اشیا را با بخار پرفشار سترون کند.

بارگنج‌ها
type: Concept
narrower: دمفشارها
preferred label: containers @en

فشار
type: Concept
preferred label: pressure @en
related: دمفشارها