نهادهای دینی
type: Concept
preferred label: religious institutions @en
related: کارکنان مراکز مذهبی

کارکنان مراکز مذهبی
type: Concept
broader: کارکنان
preferred label: workers in religion @en
related: نهادهای دینی
scope note: مراجع دینی، روحانیون و افرادی که وظیفه آنها ادای مراسم دینی، ترویج و بررسی ادیان است.

کارکنان
type: Concept
narrower: کارکنان مراکز مذهبی
preferred label: personnel @en