جسم صنوبری
type: Concept
alternative label: جسم کاجی
broader: دستگاه غدد درون‌ریز
preferred label: pineal body @en
related: دستگاه‌های مترشحه عصبی
scope note: جسم مخروطی شکل کوچک که با ساقه‌ای به دیوارۀ خلفی بطن سوم متصل است و ملاتونین ترشح می‌کند.

دستگاه‌های مترشحه عصبی
type: Concept
preferred label: neurosecretory systems @en
related: جسم صنوبری

دستگاه غدد درون‌ریز
type: Concept
narrower: جسم صنوبری
preferred label: endocrine system @en