پیراشامۀ قلب
type: Concept
alternative label: عضلۀ خارجی قلب
broader: قلب
preferred label: pericardium @en
scope note: کیسه‌ای متشکل از دو لایه که قلب و ریشۀ بزرگ متصل به قلب را دربر می‌گیرد.

قلب
type: Concept
narrower: پیراشامۀ قلب
preferred label: heart @en