بیماری‌های خون
type: Concept
preferred label: hematologic diseases @en
related: گندخونی

گندخونی
type: Concept
alternative label: سپتی‌سمی
broader: بیماری‌های عفونی
preferred label: septicemia @en
related: بیماری‌های خون
scope note: بیماری عفونی ناشی از گسترش ریزاندامگانها و زهرابه‌های آنها از راه گردش خون.

بیماری‌های عفونی
type: Concept
narrower: گندخونی
preferred label: infectious diseases @en