پوسیدگی‌های دندان
type: Concept
preferred label: dental caries @en
related: ریشه‌دندان‌پزشکی

ریشه‌دندان‌پزشکی
type: Concept
alternative label: تخصص ریشه
broader: دندان‌پزشکی
preferred label: endodontics @en
related: پوسیدگی‌های دندان
scope note: شاخه‌ای از دندان‌پژشکی که موضوع آن زیست‌شناسی و آسیب‌شناسی مغزۀ دندان و بافت‌های پیرادندانی و تشخیص و درمان بیماری‌های مربوط به آنهاست.

دندان‌پزشکی
type: Concept
narrower: ریشه‌دندان‌پزشکی
preferred label: dentistry @en