دارودرمانی
preferred label: drug therapy @en
type: Concept
narrower: همسان‌درمانی

همسان‌درمانی
alternative label: هومئوپاتی
scope note: نظامی درمانی مبتنی بر اصل "همانند، همانند را شفا می دهد".
broader: دارودرمانی
preferred label: homeopathy @en
type: Concept