ساواناها
alternative label: علفزارهای استوایی
scope note: دشت بدون درخت یا زمین علفزاری که دارای درختان پراکنده باشد مخصوصاً در منطقه گرمسیری و نیمه گرمسیری.
related: زمین زیرکشت
broader: زمین (خاک)
preferred label: savannas @en
type: Concept

زمین زیرکشت
preferred label: cultivated land @en
type: Concept
related: ساواناها

زمین (خاک)
preferred label: land @en
type: Concept
narrower: ساواناها