سنگ‌نگاری
preferred label: petrography @en
type: Concept
related: سنگ‌زایی

سنگ‌زایی
scope note: شاخه‌ای از سنگ‌شناسی که به خاستگاه و چگونگی تشکیل سنگها می‌پردازد.
related: سنگ‌نگاری
broader: سنگ‌شناسی
preferred label: petrogenesis @en
type: Concept

سنگ‌شناسی
preferred label: petrology @en
type: Concept
narrower: سنگ‌زایی