پدیده‌های زیستی
preferred label: biological phenomena @en
type: Concept
narrower: جاذبه زیستی

جاذبه زیستی
alternative label: نیروی ثقل
scope note: نیروی ربایشی متقابل بین تمامی جرم‌های موجود در عالم.
broader: پدیده‌های زیستی
preferred label: biogravitation @en
type: Concept