فدارسیون بین‌المللی اطلاع‌رسانی و سندپردازی (فید)
alternative label: فدراسیون بین‌المللی سندپردازی
scope note: سازمان غیردولتی و غیرانتفاعی که در دوم سپتامبر 1895 در بروکسل به عنوان مؤسسه بین‌المللی کتابشناختی تأسیس شد. در سال 1924 تبدیل به یک فدراسیون گردید و در سال 1938 به نام FID (فید) خوانده شد.
broader: سازمان‌های غیردولتی
preferred label: International Federation for Information and Documentation (FID) @en
type: Concept

سازمان‌های غیردولتی
preferred label: nongovernmental organizations @en
type: Concept
narrower: فدارسیون بین‌المللی اطلاع‌رسانی و سندپردازی (فید)