زغال‌سنگ
preferred label: coal @en
type: Concept
narrower: لیگنیت

لیگنیت
alternative label: لینیت
scope note: نوعی زغال با مرتبت پایین که از نظر میزان کربن بین زغال‌سنگ نارس و چاق ( زغال‌سنگ سیاه مایل به قهوه‌ای تا سیاه که دارای مقدار زیادی کربن و 15 تا 50 درصد مواد فرّار است و به آن زغال‌سنگ نرم نیز اطلاق می‌شود.) قرار گرفته و دارای 35 تا 40 درصد آب است.
broader: زغال‌سنگ
preferred label: lignite @en
type: Concept