سازمان مشورتی دریانوردی بین‌الدولی (ایمکو)
alternative label: سازمان بین الدولی مشورتی دریانوردی ( ایمکو )
scope note: سازمان بین الدولی مشورتی دریانوردی ( ایمکو )
broader: آژانس‌های سازمان ملل متحد
preferred label: Intergovernmental Maritime Consultative Organization (IMCO) @en
type: Concept

آژانس‌های سازمان ملل متحد
preferred label: UN agencies @en
type: Concept
narrower: سازمان مشورتی دریانوردی بین‌الدولی (ایمکو)