پشتیبانی اداری
scope note: حمایت در خصوص دبیرخانه، خدمات اطلاعاتی، نسخه‌برداری، شرایط لازم اداری، مراسله، حسابداری، خدمات قانونی و جز اینها که برای مدیران، محققان و مهندسان شرکت‌ها یا سازمان‌ها ضرورت دارد.
related: کارکنان دفتری
broader: شرایط کار
preferred label: administrative support @en
type: Concept

کارکنان دفتری
preferred label: clerical workers @en
type: Concept
related: پشتیبانی اداری

شرایط کار
preferred label: working conditions @en
type: Concept
narrower: پشتیبانی اداری