واکنش‌های تجزیه
preferred label: decomposition reactions @en
type: Concept
narrower: آبکافت

استری کردن ( شدن)
preferred label: esterification @en
type: Concept
related: آبکافت

آبکافت
alternative label: SAPONIFICACION @en
scope note: گسسته شدن یک مولکول در واکنش با آب به طوری که بخشی از مولکول به هیدروکسیل آب و بخشی دیگر آن به یون هیدروژن بپیوندد.
related: استری کردن ( شدن)
broader: واکنش‌های تجزیه
preferred label: hydrolysis @en
type: Concept