همپارش
preferred label: isomerization @en
type: Concept
related: واکنش‌های نوآرایی

واکنش‌های شیمیایی
preferred label: chemical reactions @en
type: Concept
narrower: واکنش‌های نوآرایی

واکنش‌های نوآرایی
scope note: واکنشی هسته‌ای که نوکلئونها در آن بین هسته‌ها مبادله می‌شوند.
related: همپارش
broader: واکنش‌های شیمیایی
preferred label: rearrangement reactions @en
type: Concept