جوهای برون‌زمینی
preferred label: extraterrestrial atmospheres @en
type: Concept
related: زهره (سیاره)

سیاره‌ها
preferred label: planets @en
type: Concept
narrower: زهره (سیاره)

زهره (سیاره)
alternative label: ناهید (نجوم)
scope note: دومین سیارۀ منظومۀ شمسی از لحاظ فاصله از خورشید و نزدیک‌ترین سیاره به زمین که هم‌اندازۀ زمین است و با ابرهای ضخیم دی‌اکسیدکربن پوشیده شده است و دمای آن به 450 درجۀ سلسیوس می‌رسد.
related: جوهای برون‌زمینی
broader: سیاره‌ها
preferred label: venus @en
type: Concept