پیام‌نما
scope note: سیستمی که اطلاعات مورد نیاز روزانه را از قبیل اجناس و ساعت پرواز هواپیما و اخبار مهم سیاسی و اجتماعی، به صورت نوشته، روی صفحۀ تلویزیون ظاهر کند.
broader: سیستم‌های تلویزیون
preferred label: teletext @en
type: Concept

سیستم‌های تلویزیون
preferred label: television systems @en
type: Concept
narrower: پیام‌نما