اروپای شرقی
preferred label: Eastern Europe @en
type: Concept
narrower: اوکراین

اوکراین
scope note: کشور جمهوری، در جنوب خاوری اروپا، میان لهستان (شمال باختری)، اسلواکی، مجارستان، رومانی و ملداوی (جنوب باختری) است از 1921 تا 1991 از جمهوریهای اتحاد جماهیر شوروی بود و جمهوری شوروی سوسیالیستی اوکراین خوانده می‌شد و به انبار غلۀ اتحاد شوروی معروف بود.
broader: اروپای شرقی
preferred label: Ukrainian @en
type: Concept