اسکاندیناوی
preferred label: Scandinavia @en
type: Concept
narrower: جزایر فارو

جزایر فارو
scope note: به دانمارکی فروئرنه؛ به معنی جزایر گوسفندان، مجمع الجزایری متشکل از 22 جزیره در اقیانوس اطلس شمالی بین جزایر شتلند و ایسلند.
broader: اسکاندیناوی
preferred label: Faroe islands @en
type: Concept