دریای سرخ
alternative label: بحر احمر
scope note: شاخابۀ شمال باختری اقیانوس هند، میان شبه جزیرۀ عربستان، مصر، سودان و اتیوپی.
related: خلیج‌ها
broader: اقیانوس هند
preferred label: Red sea @en
type: Concept

خلیج‌ها
preferred label: gulfs @en
type: Concept
related: دریای سرخ

اقیانوس هند
preferred label: Indian Ocean @en
type: Concept
narrower: دریای سرخ