اقیانوسیه
preferred label: Oceania @en
type: Concept
narrower: تونگا

تونگا
scope note: کشور پادشاهی، شامل گروهی جزیره در پلینزی، جنوب باختری اقیانوس آرام و شمال خاوری زلاند نو.
broader: اقیانوسیه
preferred label: Tonga @en
type: Concept