هواپیماهای نظامی
preferred label: military aircraft @en
type: Concept
related: هواپیماهای بی‌موتور

هواپیماها
preferred label: airplanes @en
type: Concept
narrower: هواپیماهای بی‌موتور

هواپیماهای بی‌موتور
alternative label: PLANEADORES REMOLCADOS @en
scope note: هواگردی با بال ثابت که برای پرواز بدون استفاده از نیروی موتور طراحی شده باشد و اغلب برای اهداف آموزشی و تفریحی استفاده شود.
related: هواپیماهای نظامی
broader: هواپیماها
preferred label: gliders @en
type: Concept