آفریقای فرانسه زبان
preferred label: French Speaking Africa @en
type: Concept
related: توگو

غرب آفریقا
preferred label: West Africa @en
type: Concept
narrower: توگو

توگو
scope note: کشور جمهوری در باختر آفریقا، میان خلیج گینه (جنوب)، غنا (باختر)، بورکینافاسو (شمال) و بنین (خاور).
related: آفریقای فرانسه زبان
broader: غرب آفریقا
preferred label: Togo @en
type: Concept