آنتیل‌های هلند
scope note: گروهی جزیرۀ خودگردان قلمرو هلند از جزیزگان هند غربی، در دریای کارائیب، شامل گروه جنوبی (کوراسائو، آروبا و بونر) در سواحل شمالی ونزوئلا و گروه شمالی (سنت‌مارتین، سنت‌یوستاتیوس و سبا) در خاور پرتوریکو.
broader: کارائیب
preferred label: Netherlands Antilles @en
type: Concept

کارائیب
preferred label: Caribbean @en
type: Concept
narrower: آنتیل‌های هلند