سنت کیتس و نویس
scope note: دولت مستقلی در شمال جزایر لیوارد، خاور دریای کارائیب، شامل جزیره‌های سنت کیتس و نویس.
broader: کشورهای متحده هند غربی (کارائیب)
preferred label: Saint Kitts & Nevis @en
type: Concept

کشورهای متحده هند غربی (کارائیب)
preferred label: West Indies Associated States @en
type: Concept
narrower: سنت کیتس و نویس