مارتینیک
scope note: از جزایر ویندوارد در خاور دریای کارائیب، بخشی از قلمرو ماورای بحار فرانسه است.
broader: کارائیب
preferred label: Martinique @en
type: Concept

کارائیب
preferred label: Caribbean @en
type: Concept
narrower: مارتینیک