فشار
preferred label: pressure @en
type: Concept
related: دمفشارها

بارگنج‌ها
preferred label: containers @en
type: Concept
narrower: دمفشارها

دمفشارها
alternative label: اتوکلاوها
scope note: دستگاهی که مواد خوراکی و اشیا را با بخار پرفشار سترون کند.
related: فشار
broader: بارگنج‌ها
preferred label: autoclaves @en
type: Concept