خاک‌ها
preferred label: soils @en
type: Concept
narrower: لای

لای
scope note: ذرات ریز معدنی خاک، حد فاصل رس و شن، با قطر بین دو هزارم تا پنج صدم میلی‌متر.
broader: خاک‌ها
preferred label: silt @en
type: Concept