خاک‌ها
preferred label: soils @en
type: Concept
narrower: لوم‌ها

لوم‌ها
alternative label: رودرفت‌ها
scope note: مخلوط خاک رس و شن که همراه با مواد پوسیده گیاهی باشد.
broader: خاک‌ها
preferred label: loams @en
type: Concept