مغز
preferred label: brain @en
type: Concept
narrower: مغز نخست

مغز نخست
alternative label: LOBULO TEMPORAL @en
scope note: مربوط به قسمت بیشتر مغز جلویی به‌خصوص شامل نیمکره‌های مغز و همچنین منطقۀ مجاور قسمت قدامی بطن سوم و قسمت قدامی هیپوتالاموس است.
related: دستگاه کناره‌ای (مغز)
broader: مغز
preferred label: telencephalon @en
type: Concept

دستگاه کناره‌ای (مغز)
preferred label: limbic system @en
type: Concept
related: مغز نخست