پیراشامۀ قلب
alternative label: عضلۀ خارجی قلب
scope note: کیسه‌ای متشکل از دو لایه که قلب و ریشۀ بزرگ متصل به قلب را دربر می‌گیرد.
broader: قلب
preferred label: pericardium @en
type: Concept

قلب
preferred label: heart @en
type: Concept
narrower: پیراشامۀ قلب