مجرای صفراوی
preferred label: biliary tract @en
type: Concept
narrower: مجاری صفرا

کبد
preferred label: liver @en
type: Concept
related: مجاری صفرا

مجاری صفرا
scope note: هریک از مجراها یا گذرگاه‌های هدایت‌کنندۀ صفرا در کبد و از کبد.
related: کبد
broader: مجرای صفراوی
preferred label: bile ducts @en
type: Concept