رزین‌های هالوکربن
scope note: رزین‌های تشکیل شده از بسپارش تکپارهای ساخته شده از هیدروکربن‌های هالوژن‌دار شده.
related: رزین‌های تترافلوئورواتیلن
broader: پلاستیک‌ها
preferred label: halocarbon resins @en
type: Concept

رزین‌های تترافلوئورواتیلن
preferred label: tetrafluoroethylene resins @en
type: Concept
related: رزین‌های هالوکربن

پلاستیک‌ها
preferred label: plastics @en
type: Concept
narrower: رزین‌های هالوکربن