اختلالات رفتاری
preferred label: behavioural disorders @en
type: Concept
narrower: درخودماندگی

درخودماندگی
alternative label: اوتیسم
scope note: اختلالی روانی که شواهد نخستین آن در اوایل کودکی ظاهر می‌شود و کودک مبتلا در برقرارکردن ارتباط و تعامل اجتماعی و بازی کردن نقایص چشمگیری دارد.
broader: اختلالات رفتاری
preferred label: autism @en
type: Concept