تب کیو
scope note: بیماری عفونی حاد ناشی از کوکسیلا بورنتیئی است. در انسان، معمولاً در پی استنشاق گردوغبار آلوده به‌دست آمده از حیوانات اهلی آلوده (گاو، گوسفند،..)کسب می‌شود. مشخصه آن تب ناگهانی، سردرد ، بیقراری و ضعف است.
broader: بیماری‌های ریکتزیایی
preferred label: Q fever @en
type: Concept

بیماری‌های ریکتزیایی
preferred label: rickettsial diseases @en
type: Concept
narrower: تب کیو