lower house
alternative label: CAMARA DE REPRESENTANTES
scope note: این اصطلاح از نظامهای اروپایی دارای قوه مقننه دو مجلسی گرفته شده و مبتنی بر نمایندگی می‌باشد. معمولاًً مجلس پایین‌تر با عنوانهایی مثل مجلس نمایندگان (آمریکا) یا مجلس عوام (انگلستان) مشخص می شود. @fa
broader: parliament
preferred label: مجلس پایین‌تر @fa
type: Concept

parliament
preferred label: مجلس @fa
type: Concept
narrower: lower house