قیرهای خمیری
alternative label: ماستیک‌ها
scope note: قیری که با اضافه کردن مواد شیمیایی به صورت خمیر درآید.
related: قیرها
broader: مصالح ساختمانی
preferred label: mastics @en
type: Concept

قیرها
preferred label: bitumens @en
type: Concept
related: قیرهای خمیری

مصالح ساختمانی
preferred label: construction materials @en
type: Concept
narrower: قیرهای خمیری