نورامینیک اسید
scope note: یکی از آمینوقندهای مهم که در بافتهای حیوانی و در مواد ترشح شده، به‌ویژه به صورت مشتقهای ان-آسیل به فراوانی وجود دارد.
broader: کربوکسیلیک اسیدها
preferred label: neuraminic acid @en
type: Concept

کربوکسیلیک اسیدها
preferred label: carboxylic acids @en
type: Concept
narrower: نورامینیک اسید