باکتری‌ها
preferred label: bacteria @en
type: Concept
narrower: پسودومونادال‌ها

پسودومونادال‌ها
scope note: راسته‌ای از باکتریها در برخی از نظامهای رده‌بندی برای نشان‌دادن ارگانیسم‌های دارای تاژکهای قطبی.
broader: باکتری‌ها
preferred label: pseudomonadales @en
type: Concept