دادگاه‌های قانون اساسی
scope note: هیئت قضایی مسئول هماهنگی قوانین، احکام و مقررات با قانون اساسی.
related: قانون اساسی
broader: هیئت‌های قضایی
preferred label: constitutional courts @en
type: Concept

قانون اساسی
preferred label: constitutional law @en
type: Concept
related: دادگاه‌های قانون اساسی

هیئت‌های قضایی
preferred label: judicial bodies @en
type: Concept
narrower: دادگاه‌های قانون اساسی