مابعدالطبیعه
preferred label: metaphysics @en
type: Concept
narrower: یینگ یانگ

اصل
preferred label: principle @en
type: Concept
related: یینگ یانگ

یینگ یانگ
scope note: دو اصل متضاد و در عین حال مکمل در گیتی است که بر اساس اسطورۀ چینی یین و یانگ است. یانگ مظهر آسمان، نیروی فعال و نر، مهاجم، محرک، روشن، گرم و خشک و یین، مظهر زمین، منفعل و ماده، مظهر سردی، تاریکی، سنگینی و رطوبت است.
related: اصل
broader: مابعدالطبیعه
preferred label: ying yang @en
type: Concept