نوکلئیک اسیدها
preferred label: nucleic acids @en
type: Concept
narrower: آر.ان.آ

آر.ان.آ
alternative label: ریبونوکلئیک اسید
scope note: بسپاری متشکل از واحدهای ریبونوکلئوتید. "رنا" پیشنهاد فرهنگستان زبان و ادب فارسی است.
broader: نوکلئیک اسیدها
preferred label: RNA @en
type: Concept