آنتیگوا و باربودا
scope note: کشوری شامل سه جزیره از جزیرگان هند غربی، در جزایر لیوارد از گروه آنتیل کوچک.
broader: کشورهای متحده هند غربی (کارائیب)
preferred label: Antigua & Barbuda @en
type: Concept

کشورهای متحده هند غربی (کارائیب)
preferred label: West Indies Associated States @en
type: Concept
narrower: آنتیگوا و باربودا