نهادهای دینی
preferred label: religious institutions @en
type: Concept
related: کارکنان مراکز مذهبی

کارکنان
preferred label: personnel @en
type: Concept
narrower: کارکنان مراکز مذهبی

کارکنان مراکز مذهبی
scope note: مراجع دینی، روحانیون و افرادی که وظیفه آنها ادای مراسم دینی، ترویج و بررسی ادیان است.
related: نهادهای دینی
broader: کارکنان
preferred label: workers in religion @en
type: Concept