دستگاه‌های مترشحه عصبی
preferred label: neurosecretory systems @en
type: Concept
related: جسم صنوبری

جسم صنوبری
alternative label: جسم کاجی
scope note: جسم مخروطی شکل کوچک که با ساقه‌ای به دیوارۀ خلفی بطن سوم متصل است و ملاتونین ترشح می‌کند.
related: دستگاه‌های مترشحه عصبی
broader: دستگاه غدد درون‌ریز
preferred label: pineal body @en
type: Concept

دستگاه غدد درون‌ریز
preferred label: endocrine system @en
type: Concept
narrower: جسم صنوبری