بیماری‌های عفونی
preferred label: infectious diseases @en
type: Concept
narrower: گندخونی

گندخونی
alternative label: سپتی‌سمی
scope note: بیماری عفونی ناشی از گسترش ریزاندامگانها و زهرابه‌های آنها از راه گردش خون.
related: بیماری‌های خون
broader: بیماری‌های عفونی
preferred label: septicemia @en
type: Concept

بیماری‌های خون
preferred label: hematologic diseases @en
type: Concept
related: گندخونی