مایکوپلاسماتال‌ها
alternative label: میکوپلاسماتلاها
scope note: راسته‌ای از باکتریها از ردۀ مولیکوتها که اعضای آن با غشایی سه لایه محصور شده‌اند اما فاقد دیوارۀ یاخته‌ای سفت هستند.
broader: باکتری‌ها
preferred label: mycoplasmatales @en
type: Concept

باکتری‌ها
preferred label: bacteria @en
type: Concept
narrower: مایکوپلاسماتال‌ها