اخترسنجی
scope note: اندازه‌گیری موقعیت دقیق سیاره‌ها، سیّاره‌ها و سایر اجرام در فضا.
broader: مکانیک سماوی
preferred label: astrometry @en
type: Concept

مکانیک سماوی
preferred label: celestial mechanics @en
type: Concept
narrower: اخترسنجی